iOS-Hierarchy-Viewer build failed : linker command failed with exit code 1


ondrej
HOME ยป Operating Systems

I find a project called "iOS-Hierarchy-Viewer" that can inspect the ios native Views.
so I create a project called "ViewViewer" and do as the workaround of the "Installation" just README.md describles.
however, when I build it, and failed.


error:


Ld /Users/hundsun/Library/Developer/Xcode/DerivedData/iphone-gsuyenresnoeexcuqguzciigntxr/Build/Products/Debug-iphonesimulator/ViewViewer.app/ViewViewer normal i386
cd /Users/hundsun/Documents/projects/ViewViewer
setenv MACOSX_DEPLOYMENT_TARGET 10.6
......
Undefined symbols for architecture i386:
"_OBJC_CLASS_$_NSAttributeDescription", referenced from:

Related to : iOS-Hierarchy-Viewer build failed : linker command failed with exit code 1
iOS-Hierarchy-Viewer build failed : linker command failed with exit code 1
by ondrej in Operating Systems

I find a project called "iOS-Hierarchy-Viewer" that can inspect the ios native Views.
so I create a project called "ViewViewer" and do as the workaround of the "Installation" just README.md describles.
however, when I build it, and failed.


error:


Ld /Users/hu
Failed to deploy an application into device like iPad-Linker command failed with Exit code 1
by Allan in Operating Systems

I am a beginner in native application.I am developing applications using Objective C as front end , SUP as middleware and SAP as backend.I have a valid provisioning certificate with a valid bundle identifier.I tried deploying one of my simple applications into the device(iPAD) which is not having


Xcode 6 build Error: Linker command failed with exit code 1(use -v to see invocation)
24/11/2014 5:20 am by rodvand in Operating Systems

I am getting below error when i build a project so kindly help me please.

clang: error: linker command failed with exit code 1 (use -v to see invocation) in Xcode 6

ld: warning: directory not found for option '-L/Users/vasanthmani/Documents/iphone/m-banking/trunk/MBanking/Images/D


Apple Mach-O Linker Error (linker command failed with exit code 1)
by dEXterz in Operating Systems

When attempting to run my test class i get the following error


Undefined symbols for architecture i386:
"_OBJC_CLASS_$_Client", referenced from:
objc-class-ref in eFit2Tests.o
ld: symbol(s) not found for architecture i386
clang: error: linker command failed


xcode 6: Apple mach-o linker error; linker command failed with exit code 1
8/12/2014 10:20 am by FriendL in Operating Systems

i am trying to create a archive of my ios project which created using xcode 6. it is working fine in my stimulater but when i try to create an archive of this it gives me this error.

ld: library not found for -lobjc clang: error: linker command failed with exit code 1 (us


linker command failed with exit code 1 - iOS
by Alec in Operating Systems

I have an error at compile time. Seems to be weird. it worked as detail view application but using single view doesn't seem to work.
this is the error details


Undefined symbols for architecture i386:
"_OBJC_CLASS_$_RssArticle", referenced from:
objc-cl
linker command failed with exit code 1
31/12/2014 12:40 pm by futurefields in Operating Systems

I have app it's working good , but i am add chat view ( Xib - .h - .m ) files and every thing it's ok, but when i try to run it on my iPhone i got this problem:

linker command failed with exit code 1 

   
/Users/ZzXzZ/Library/Developer/Xcode/DerivedData/9otk-exeoubkkvfbvbkejxccjh
Linker command failed with exit code 1 In Xcode
by tolis626 in Operating Systems

I'm writing C program in Xcode, and I got this problem:


ld: 1 duplicate symbol for architecture x86_64
clang: error: linker command failed with exit code 1 (use -v to see invocation)

Any idea to solve it?


Note: I've just update my OS to Mountai


linker command failed with exit code 1 in xcode 4.3.2
by Baskaran in Operating Systems

I am working on a universal application but it gives linker error after adding a new class [CallScreenViewController]


duplicate symbol _applicationFrame in /Users/msdk/Library/Developer/Xcode/DerivedData/UniversalTest-cxggvelerfpnpgfzfehcwddjtfkd/Build/Intermediates/UniversalTest.bu


linker command failed with exit code 1 (error; cannot seem to fix it)
by el3ctron in Operating Systems

I keep on getting this error in my code:Ld /Users/mregdosz/Library/Developer/Xcode/DerivedData/Chapter_3_Absolute_C++-fudhoiytotorpfhkhmdsghdoaicn/Build/Products/Debug/Chapter 3 Project 10 Take 2 normal x86_64cd "/Users/mregdosz/Documents/Absolute C++/Absolute C++/Chapter 3 Absolute C++/Chapter 3 Ab


HD Wallpapers
3D
3D Abstract
City
Celebrities
Indian Celebrities
Cars
Travel
Girls
Animals Birds
Movies
Sports
Black White
Nature
Planes
Anime
Food Drink
Dreamy Fantasy
Architecture
Games
Space
Holidays
Flowers
Love
Artistic
Baby
Beach
Bikes Motorcycles
Macro
Computers
Vector
Funny
Army
Textures
Brands
Misc
Music
Other
Privacy Policy - Copyrights Notice - Feedback - Report Violation - RSS 2017 © bighow.org All Rights Reserved .