Publishing web project to azure failed: The “IsolatedCSPack” task failed unexpectedly


jcwagers
HOME ยป Web Design

I have web application that I want to publish and upload to windows azure.
I use Visual Studio 2008.
I click on "publish", chose "Create Service Package Only" in "Publish Cloud Service" window, andclick on "OK".
The publish failed tnd the exception is:


Error 26 The "IsolatedCSPack" task failed unexpectedly.
System.OutOfMemoryException: Exception of type 'System.OutOfMemoryException' was thrown.
Server stack trace:
at System.IO.MemoryStream.set_Capacity(Int32 value)
at System.IO.MemoryStream.EnsureCapacity(Int32 value)
at System.IO.MemoryStream.Write(Byte[] buffer, Int32 offset, Int32 count)

Related to : Publishing web project to azure failed: The “IsolatedCSPack” task failed unexpectedly
Publishing web project to azure failed: The “IsolatedCSPack” task failed unexpectedly
by jcwagers in Web Design

I have web application that I want to publish and upload to windows azure.
I use Visual Studio 2008.
I click on "publish", chose "Create Service Package Only" in "Publish Cloud Service" window, andclick on "OK".
The publish failed tnd the exception is:


Error 26 The "Iso
The “CreateRiaClientFilesTask” task failed unexpectedly
by skulldrinker in Web Design

I've VS 2010 and recently installed WCF RIA Services V1.0. For testing I have created a new Silverligh Business project but now every now and then when I rebuild the solution I receive the following error:


Does anybody know why I get this?


Thanks


Error 1 Th


LightSwitch beta 1: “CreateRuntimeExtensionAssembliesManifest” task failed unexpectedly
by Martin Koch in Web Design

Using LightSwitch Beta 1, every time I build my project I get this error on the ServerGenerated project:


The "CreateRuntimeExtensionAssembliesManifest" task failed unexpectedly.
System.NullReferenceException: Object reference not set to an instance of an object.
at Micros
Resources, “GenerateResource” task failed unexpectedly (Image.Save), and TIFFs?
by CRaul87 in Web Design

VS2008 SP1


The C# compiler is giving me "Generate" task failed unexpectedly ... (Image.Save) when I try to compile my project, which has a resx file to which I've added a TIFF file.


I haven't yet written any code to reference the resource -- just having the TIFF file inclu


Failed to generate scripts for Sql Azure database: “Getting the list of objects from : failed”
by xguru in Web Design

I follow http://msdn.microsoft.com/en-us/library/ee621790.aspx instructions and on get the following error:


Getting the list of objects from 'MYDBNAME'. Failed



Microsoft.SqlServer.Management.Sdk.Sfc.EnumeratorException: Failed to retrieve data for this reque


Azure Package not working ProvideAssemblyProcessorArchitecture" task failed unexpectedly
by Nidleb in Web Design

The azure project and the worker role are building ok but when I go to package it I get the below error. Trying to use azure 1.7 SDK, though I have both 1.7 and 1.8 installed on my machine. I even deleted my Kaspersky antivirus software in case it was causing it somehow.


Please help.<


How do I publish ASP.NET MVC3 application to azure using “Publish -> ”Web Deploy"? (getting error: Web Deployment task failed)
by buschman31 in Web Design

I'm getting this error when trying to deploy to azure using "Publish" from my MVC project. I checked Web Management Service and Web Deployment Agent Service and there are both running. Credentials I'm using are valid since I get access to server instance through remote desktop


I've al


connection to database “dbname” failed: FATAL: password authentication failed for user “postgres”
by Wilson Mar in Web Design

I created postgres db, import backup, now I want to make new backup from postgres db. This is commands, I had used:


createdb -U user dbname
psql -U user -f "C:Program FilesPostgreSQL9.2inimportimport.backup" dbname
pg_dump -U user -f "C:Program FilesPostgreSQL9.2inacku
SVN update resulting in “RA layer request failed” and “SSL handshake failed: Secure connection truncated”
by walshtp in Web Design

Occasionally, when I try to do a standard Update to HEAD using Subclipse 1.6 on MyEclipse 9.0, I get the following error:


RA layer request failed
svn: OPTIONS of 'https://svn.example.com/myrepo/myproj/trunk': SSL handshake failed: Secure connection truncated (https://svn.exampl


PHP, Zend, require_once: “failed to open stream” and “Failed opening required […]”
by skimple in Web Design

I'm going nuts! I've been SO'ing and Googling for 2 hours now.


In short, things were working fine, and then I did some class-restructuring, and now I'm getting this:


Warning: require_once(Zend/Mail/Transport/Sendmail.php) [function.require-once]: failed to open str


HD Wallpapers
3D
3D Abstract
City
Celebrities
Indian Celebrities
Cars
Travel
Girls
Animals Birds
Movies
Sports
Black White
Nature
Planes
Anime
Food Drink
Dreamy Fantasy
Architecture
Games
Space
Holidays
Flowers
Love
Artistic
Baby
Beach
Bikes Motorcycles
Macro
Computers
Vector
Funny
Army
Textures
Brands
Misc
Music
Other
Privacy Policy - Copyrights Notice - Feedback - Report Violation - RSS 2017 © bighow.org All Rights Reserved .