Android Studio failed to load JVM on Mac OSX (Mavericks)


redha
11/12/2014 10:40 pm
HOME ยป Web Development

I am trying to setup Android Studio on my Mac. It is running OSX 10.9.1 Mavericks. I have installed the latest JDK (at the time of writing 1.7 update 45), and I installed Android Studio. I use Java 7 because I have some Java applications I have to run and they require 1.7. I have not installed Java 1.6, because it is ancient and old. Launching Android Studio from any launcher does literally nothing. Activity Manager never shows it running. I do not want to install Java 1.6.

I did some work and tried to run the executable via command line through the package contents, and for both executables, I get these messages:

Error
message

I am unsure what I am supposed to do to fix this error. I'm not very adept on a Mac (still somewhat new to it, and its confusing to do power user stuff on this) so if anyone can help me figure it out that'd be great. I'm on the 2013 Macbook Air with plenty of resources for this to run.


Related to : Android Studio failed to load JVM on Mac OSX (Mavericks)
Android Studio failed to load JVM on Mac OSX (Mavericks)
11/12/2014 10:40 pm by redha in Web Development

I am trying to setup Android Studio on my Mac. It is running OSX 10.9.1 Mavericks. I have installed the latest JDK (at the time of writing 1.7 update 45), and I installed Android Studio. I use Java 7 because I have some Java applications I have to run and they require 1.7. I have not installed Ja


Android Studio gives me Execution failed for task ':library:proguardRelease' error after updating to Android Studio 1.0.1
22/12/2014 10:30 am by Ir0nh1de in Web Development

I updated my Android Studio to 1.0.1. I followed this tutorial http://tools.android.com/tech-docs/new-build-system/migrating-to-1-0-0 and changed from runProguard to minifyEnabl


Importing Android Projects into Android Studio - Gradle Project Sync Failed
19/11/2014 6:20 am by surfsatwerk in Web Development

I, like many others, am having the problem where when I import a project from eclipse into Android Studio, it will not work. I am consistently getting this error:

enter image
description here

At the bottom of the screen, th

Tableview doesn't load with error “Failed to load resource” on Android 2.2
by mikeymikec in Web Development

My app works fine on the iPhone simulator. However, when I launch the Android 2.2 simulator, the app loads (all the tabs appear) but then it crashes before my TableView appears. Here's the error:


E/TiJSError( 269): (main) [644,1030] ----- Titanium Javascript Runtime Error ----- TAGS: Tableview doesn load with error ldquo
VB2008 Studio Exe file(LOAD REPORT FAILED)
by wraith in Web Development

I build my project then I open the EXE file at the RELEASE FOLDER, when generating in a crystal report a error message pops up "LOAD REPORT FAILED".


Android Studio Start Failed
26/4/2016 6:52 am by ferpaz in Web Development

I've just installed android studio. For the first time when I run that after a short while (after showing a loading bar), It shows me this error. So I searched in Internet and I did Everything I could,(downloading the last version on Java, re-installing the Program and run it for the first time a


Visual Studio 2012 Coded UI testing failed to load package
by B3CFT in Web Development

I have a project which I have to add a coded UI test into.


If I create a test it gives me the following error:


The following package failed to load: C:UsersAppDataLocalassemblydl3W2RG6NJ4.G6OTMOZA01A.527ad952cf5PublicAssembliesMicrosoft.VisualStudio.TestTools.UITesting.dll


Unable to load com.android.builder.model.SigningConfig in Android Studio
14/11/2014 8:30 am by Aravinth in Web Development

Im new to Android Studio. Getting this issue.Please Help me out.

Failed to sync Gradle project 'Test' Unable to load class 'com.android.builder.model.SigningConfig'

I tried to re-download dependencies but its now working. Giving the same error.

TAGS: Unable load android builder model SigningConfig

Error Android Studio Execution Failed
28/12/2014 9:40 am by Dan Ingraham in Web Development

I Am Having a problem with android studio that i cant figure out how to fix so please help.

When i build my app it gives me an error : Execution failed for task ':app:dexDebug' but when i make a new project it works fine

Log:

 Error:Execution failed for task ':app:
Android Studio / Gradle: proguardRelease FAILED
30/12/2014 2:10 pm by Matthew Damp in Web Development

Using Android Studio, I am getting a proguardRelease FAILED error:

FAILURE: Build failed with an exception.

* What went wrong:
Execution failed for task ':appName:proguardAppNameRelease'.
> 1

* Try:
Run with --stacktrace option to get the stack trace. Run with --info
or --deb


HD Wallpapers
3D
3D Abstract
City
Celebrities
Indian Celebrities
Cars
Travel
Girls
Animals Birds
Movies
Sports
Black White
Nature
Planes
Anime
Food Drink
Dreamy Fantasy
Architecture
Games
Space
Holidays
Flowers
Love
Artistic
Baby
Beach
Bikes Motorcycles
Macro
Computers
Vector
Funny
Army
Textures
Brands
Misc
Music
Other
Privacy Policy - Copyrights Notice - Feedback - Report Violation - RSS 2017 © bighow.org All Rights Reserved .