Cordova Error Error: Error code 1 for command: cmd with args: /s,/c,


vi edit
7/5/2016 5:43 am
HOME ยป Web Development

when I write this command in cmd cordova build android, this error happens:

FAILURE: Build failed with an exception. Where:

Script 'H:prjPathprjNameplatformsandroidCordovaLibcord

ova.gradle' line: 64 What went wrong: A problem occurred evaluating root project 'android'.

>
No installed build tools found. Please install the Android build tools
version 1
9.1.0 or higher.

Try:

Run with --stacktrace option to get the stack trace. Run
with --info or --debug

option to get more log output.

BUILD FAILED
Error: Error code 1 for command: cmd with args:
/s,/c,""H:prjPathprjNameplatformsandroidgradlew" cdvBuildDebug -b
"H:prjPathprjNameplatformsandroiduild.gradle"
-Dorg.gradle.daemon=true -Pan
droid.useDeprecatedNdk=true"

what should I do?!! and this is my SDK managerSDK Manager


Related to : Cordova Error Error: Error code 1 for command: cmd with args: /s,/c,
Cordova Error Error: Error code 1 for command: cmd with args: /s,/c,
7/5/2016 5:43 am by vi edit in Web Development

when I write this command in cmd cordova build android, this error happens:

FAILURE: Build failed with an exception. Where:

Script 'H:prjPathprjNameplatformsandroidCordovaLibcord

ova.gradle' line: 64 What went wrong: A problem occurred evaluating root p


Visual Studio Command Prompt C/C++ Compiling Error “ Error Code C2143: syntax error : missing ')' before ';' ”
by kamyar in Web Development

I'm new to writing code and have spent hours trying to solve this error.
The script is for a memory scanner. Here is the code I have. The error is in
line 147. It keeps giving me error C2143 missing ')' before ' ; ' ...


#include <windows.h>
#include <st
Phonegap/cordova command line gives code signing error, xcode works fine. (IOS)
28/11/2014 11:00 am by silvervino in Web Development

When entering the command

phonegap run ios

I get the following error:

=== BUILD TARGET F-Securities OF PROJECT F-Securities WITH
CONFIGURATION Debug ===

Check dependencies
Code Sign error: No code signing identities found: No valid signing
identi
Error in ns-2 "error "error when calling class $cls: $args" $...""
27/12/2014 11:40 am by Progdis in Web Development

In ns-2 i get this error even i re install mu ns-2.

ns: _o5136 unknown-flow 44 127 1061001022:

(_o5136 cmd line 1)
invoked from within

"_o5136 cmd unknown-flow 44 127 1061001022"

invoked from within

"catch "$self cmd $ar


Error """ java.lang.RuntimeException: command failed with Symbian error code: -4
by debuke in Web Development
I have using NetBeans with S60 3rd Ed. to develop a program.
My program mainly contains some binary files, and I put it as resource file (in res folder)
The jar is built with arround 5MB.
And I try to run this program with S60 emulator, however it promt out an error of "[B]java.l
AppDelegate.o error: clang: error: linker command failed with exit code 1 (use -v to see invocation)
by Liy in Web Development

When trying to build my project, I got this linking error stack:


ld: file not found: /Users/Malloc/Library/Developer/Xcode/DerivedData/MyAppName-gruqlxmpxhdoyrccsduabidcnvcz/Build/Intermediates/MyAppName.build/Debug-iphoneos/MyAppName.build/Objects-normal/armv7/AppDelegate.o
<
Cocos2d error - clang: error: linker command failed with exit code 1 (use -v to see invocation)
by MovingSpotlight in Web Development

I keep getting this error:
clang: error: linker command failed with exit code 1 (use -v to see invocation)...
when I'm compiling my game. I'm am using Cocos2d. Can anyone help?


how to solve the error(clang: error: linker command failed with exit code 1 (use -v to see invocation) )
by KaoFloppy in Web Development

I've downloaded a sample source code from here, but when I open that, I'm getting the error "Clang: Error: Linker Command Failed With Exit Code 1 (Use -V To See Invocation)"


Error (Error Code: 1175) during executing update command on table using MySQL Workbench 5.2
by Tim Tyrrell in Web Development

I'm using MySQL Server5.5 in which MySQL Workbench 5.2 CE is included. I'm using MySQL Workbench 5.2 . I have a table named user in DB. I executed the following command on SQL Editor at MySQL Workbench:


UPDATE user SET email = 'abc@yahoo.com' WHERE email='ripon.wasim@yahoo.com'; TAGS: Error Error Code 1175 during executing
cordova platform add android command error
16/12/2014 1:10 am by Koen Willemse in Web Development

my path is User variable for will C:UserswillAppDataRoaming pm;C:Program FilesJavajdk1.8.0_25in;C:UserswillAppDataLocalAndroidsdk;%JAVA_HOME%in;

system variable C:ProgramDataOracleJavajavapath;C:Program Files (x86)NVIDIA CorporationPhysXCommon;C:Program FilesCommon FilesMicrosoft Share


Privacy Policy - Copyrights Notice - Feedback - Report Violation - RSS 2014 © bighow.org All Rights Reserved .